Reaction Details
TargetAmyloid-beta precursor protein
LigandBDBM50263997
Substrate/Competitorn/a
Meas. Tech.ChEMBL_535894 (CHEMBL983535)
IC50 80±n/a nM
Citation Byun, JHKim, HKim, YMook-Jung, IKim, DJLee, WKYoo, KH Aminostyrylbenzofuran derivatives as potent inhibitors for Abeta fibril formation. Bioorg Med Chem Lett18:5591-3 (2008) 
 
Amyloid-beta precursor protein
Name:Amyloid-beta precursor protein
Type:Single-pass type I membrane protein
Mol. Mass.:86890.41
Organism:Homo sapiens (Human)
Description:P05067
Residue:770
BDBM50263997
NameBDBM50263997
Synonyms:4-(2-(5-methoxybenzofuran-2-yl)vinyl)-N-methylbenzenamine | CHEMBL523824
TypeSmall organic molecule
Emp. Form.C18H17NO2
Mol. Mass.279.3331
SMILESCNc1ccc(\C=C\c2cc3cc(OC)ccc3o2)cc1