Reaction Details
TargetNociceptin receptor
LigandBDBM50274462
Substrate/Competitorn/a
Meas. Tech.ChEMBL_537143 (CHEMBL989803)
IC50 0.31±n/a nM
Citation Okada, KIsozaki, KLi, JMatsushima, ANose, TCosta, TShimohigashi, Y Synergistic effect of basic residues at positions 14-15 of nociceptin on binding affinity and receptor activation. Bioorg Med Chem16:9261-7 (2008) 
 
Nociceptin receptor
Name:Nociceptin receptor
Type:Enzyme Catalytic Domain
Mol. Mass.:40531.08
Organism:RAT
Description:Nociceptin/Orphanin FQ, NOP receptor 0 RAT::P35370
Residue:367
BDBM50274462
NameBDBM50274462
Synonyms:CHEMBL526333 | FGGFTGARKSARKLRNQ
TypeSmall organic molecule
Emp. Form.C82H136N30O22
Mol. Mass.1894.145
SMILES[#6]-[#6](-[#6])-[#6]-[#6@H](-[#7]-[#6](=O)-[#6@H](-[#6]-[#6]-[#6]-[#6]-[#7])-[#7]-[#6](=O)-[#6@H](-[#6]-[#6]-[#6]\[#7]=[#6](/[#7])-[#7])-[#7]-[#6](=O)-[#6@H](-[#6])-[#7]-[#6](=O)-[#6@H](-[#6]-[#8])-[#7]-[#6](=O)-[#6@H](-[#6]-[#6]-[#6]-[#6]-[#7])-[#7]-[#6](=O)-[#6@H](-[#6]-[#6]-[#6]\[#7]=[#6](/[#7])-[#7])-[#7]-[#6](=O)-[#6@H](-[#6])-[#7]-[#6](=O)-[#6]-[#7]-[#6](=O)-[#6@@H](-[#7]-[#6](=O)-[#6@H](-[#6]-c1ccccc1)-[#7]-[#6](=O)-[#6]-[#7]-[#6](=O)-[#6]-[#7]-[#6](=O)-[#6@@H](-[#7])-[#6]-c1ccccc1)-[#6@@H](-[#6])-[#8])-[#6](=O)-[#7]-[#6@@H](-[#6]-[#6]-[#6]\[#7]=[#6](/[#7])-[#7])-[#6](=O)-[#7]-[#6@@H](-[#6]-[#6](-[#7])=O)-[#6](=O)-[#7]-[#6@@H](-[#6]-[#6]-[#6](-[#7])=O)-[#6](-[#8])=O