Reaction Details
TargetTyrosine-protein kinase SYK
LigandBDBM50274757
Substrate/Competitorn/a
Meas. Tech.ChEMBL_537397 (CHEMBL992587)
IC50 28±n/a nM
Citation Hirabayashi, AMukaiyama, HKobayashi, HShiohara, HNakayama, SOzawa, MTsuji, EMiyazawa, KMisawa, KOhnota, HIsaji, M Structure-activity relationship studies of imidazo[1,2-c]pyrimidine derivatives as potent and orally effective Syk family kinases inhibitors. Bioorg Med Chem16:9247-60 (2008) 
 
Tyrosine-protein kinase SYK
Name:Tyrosine-protein kinase SYK
Type:Enzyme
Mol. Mass.:72079.99
Organism:Homo sapiens (Human)
Description:P43405
Residue:635
BDBM50274757
NameBDBM50274757
Synonyms:5-((1S,2R)-2-Aminocyclohexylamino)-7-(3,5-dimethoxyphenylamino)-2-phenylimidazo[1,2-c]pyrimidine-8-carboxamide | CHEMBL459147
TypeSmall organic molecule
Emp. Form.C27H31N7O3
Mol. Mass.501.5801
SMILESCOc1cc(Nc2nc(N[C@H]3CCCC[C@H]3N)n3cc(nc3c2C(N)=O)-c2ccccc2)cc(OC)c1