Reaction Details
TargetTyrosine-protein kinase SYK
LigandBDBM50274756
Substrate/Competitorn/a
Meas. Tech.ChEMBL_537397 (CHEMBL992587)
IC50 6±n/a nM
Citation Hirabayashi, AMukaiyama, HKobayashi, HShiohara, HNakayama, SOzawa, MTsuji, EMiyazawa, KMisawa, KOhnota, HIsaji, M Structure-activity relationship studies of imidazo[1,2-c]pyrimidine derivatives as potent and orally effective Syk family kinases inhibitors. Bioorg Med Chem16:9247-60 (2008) 
 
Tyrosine-protein kinase SYK
Name:Tyrosine-protein kinase SYK
Type:Enzyme
Mol. Mass.:72079.99
Organism:Homo sapiens (Human)
Description:P43405
Residue:635
BDBM50274756
NameBDBM50274756
Synonyms:CHEMBL459146 | cis-5-(2-Aminocyclohexylamino)-7-(3,5-dimethylphenylamino)imidazo[1,2-c]pyrimidine-8-carboxamide
TypeSmall organic molecule
Emp. Form.C21H27N7O
Mol. Mass.393.4854
SMILESCc1cc(C)cc(Nc2nc(N[C@H]3CCCC[C@H]3N)n3ccnc3c2C(N)=O)c1