Reaction Details
TargetTyrosine-protein kinase ZAP-70
LigandBDBM50274758
Substrate/Competitorn/a
Meas. Tech.ChEMBL_537398 (CHEMBL992588)
IC50 160±n/a nM
Citation Hirabayashi, AMukaiyama, HKobayashi, HShiohara, HNakayama, SOzawa, MTsuji, EMiyazawa, KMisawa, KOhnota, HIsaji, M Structure-activity relationship studies of imidazo[1,2-c]pyrimidine derivatives as potent and orally effective Syk family kinases inhibitors. Bioorg Med Chem16:9247-60 (2008) 
 
Tyrosine-protein kinase ZAP-70
Name:Tyrosine-protein kinase ZAP-70
Type:Enzyme
Mol. Mass.:69881.61
Organism:Homo sapiens (Human)
Description:ZAP-70 SH2 domain was expressed and purified from E. coli using O-phospho-L-tyrosine-agarose column.
Residue:619
BDBM50274758
NameBDBM50274758
Synonyms:5-(2-Amino-2-methylpropylamino)-7-(3,5-dimethoxyphenylamino)-2-phenylimidazo[1,2-c]pyrimidine-8-carboxamide | CHEMBL458806
TypeSmall organic molecule
Emp. Form.C25H29N7O3
Mol. Mass.475.5429
SMILESCOc1cc(Nc2nc(NCC(C)(C)N)n3cc(nc3c2C(N)=O)-c2ccccc2)cc(OC)c1