Reaction Details
TargetTranslocator protein
LigandBDBM50274524
Substrate/Competitorn/a
Meas. Tech.ChEMBL_537932 (CHEMBL983517)
Ki 14.2±n/a nM
Citation Denora, NLaquintana, VPisu, MGDore, RMurru, LLatrofa, ATrapani, GSanna, E 2-Phenyl-imidazo[1,2-a]pyridine compounds containing hydrophilic groups as potent and selective ligands for peripheral benzodiazepine receptors: synthesis, binding affinity and electrophysiological studies. J Med Chem51:6876-88 (2008) 
 
Translocator protein
Name:Translocator protein
Type:Mitochondrion membrane protein
Mol. Mass.:18945.84
Organism:Rattus norvegicus (rat)
Description:Competitive binding experiments were performed on rat kidney mitochondrial membranes.
Residue:169
BDBM50274524
NameBDBM50274524
Synonyms:2-(8-(2-Aminoacetamido)-2-(4-chlorophenyl)imidazo[1,2-a]pyridin-3-yl)-N,N-dipropylacetamide hydrochloride | CHEMBL485435
TypeSmall organic molecule
Emp. Form.C23H28ClN5O2
Mol. Mass.441.954
SMILESCCCN(CCC)C(=O)Cc1c(nc2c(NC(=O)CN)cccn12)-c1ccc(Cl)cc1