Reaction Details
TargetTranslocator protein
LigandBDBM50204648
Substrate/Competitorn/a
Meas. Tech.ChEMBL_537932 (CHEMBL983517)
Ki 2.07±n/a nM
Citation Denora, NLaquintana, VPisu, MGDore, RMurru, LLatrofa, ATrapani, GSanna, E 2-Phenyl-imidazo[1,2-a]pyridine compounds containing hydrophilic groups as potent and selective ligands for peripheral benzodiazepine receptors: synthesis, binding affinity and electrophysiological studies. J Med Chem51:6876-88 (2008) 
 
Translocator protein
Name:Translocator protein
Type:Mitochondrion membrane protein
Mol. Mass.:18945.84
Organism:Rattus norvegicus (rat)
Description:Competitive binding experiments were performed on rat kidney mitochondrial membranes.
Residue:169
BDBM50204648
NameBDBM50204648
Synonyms:2-(6,8-dichloro-2-(thiazol-2-yl)H-imidazo[1,2-a]pyridin-3-yl)-N,N-dipropylacetamide | CHEMBL220661
TypeSmall organic molecule
Emp. Form.C18H20Cl2N4OS
Mol. Mass.411.349
SMILESCCCN(CCC)C(=O)Cc1c(nc2c(Cl)cc(Cl)cn12)-c1nccs1