Reaction Details
Target5-hydroxytryptamine receptor 2A
LigandBDBM50131085
Substrate/Competitorn/a
Meas. Tech.ChEMBL_537763 (CHEMBL994216)
Ki 1.3±n/a nM
Citation Runyon, SPMosier, PDRoth, BLGlennon, RAWestkaemper, RB Potential modes of interaction of 9-aminomethyl-9,10-dihydroanthracene (AMDA) derivatives with the 5-HT2A receptor: a ligand structure-affinity relationship, receptor mutagenesis and receptor modeling investigation. J Med Chem51:6808-28 (2008) 
 
5-hydroxytryptamine receptor 2A
Name:5-hydroxytryptamine receptor 2A
Type:undefined
Mol. Mass.:52607.65
Organism:Homo sapiens (Human)
Description:P28223
Residue:471
BDBM50131085
NameBDBM50131085
Synonyms:3-Bromo-9-aminomethyl-9,10-dihydroanthracene CHEMBL85882
TypeSmall organic molecule
Emp. Form.C15H14BrN
Mol. Mass.288.182
SMILESNCC1c2ccccc2Cc2cc(Br)ccc12