Reaction Details
TargetGalectin-7
LigandBDBM50273430
Substrate/Competitorn/a
Meas. Tech.ChEMBL_560913 (CHEMBL1013548)
Kd 22000±n/a nM
Citation Delaine, TCumpstey, IIngrassia, LLe Mercier, MOkechukwu, PLeffler, HKiss, RNilsson, UJ Galectin-inhibitory thiodigalactoside ester derivatives have antimigratory effects in cultured lung and prostate cancer cells. J Med Chem51:8109-14 (2008) 
 
Galectin-7
Name:Galectin-7
Type:Galactoside-binding protein
Mol. Mass.:15077.89
Organism:Homo sapiens (Human)
Description:n/a
Residue:136
BDBM50273430
NameBDBM50273430
Synonyms:Bis-(3-O-benzoyl-beta-D-galactopyranosyl)sulfane | CHEMBL458489
TypeSmall organic molecule
Emp. Form.C26H30O12S
Mol. Mass.566.574
SMILESOC[C@H]1O[C@@H](S[C@@H]2O[C@H](CO)[C@H](O)[C@H](OC(=O)c3ccccc3)[C@H]2O)[C@H](O)[C@@H](OC(=O)c2ccccc2)[C@H]1O