Reaction Details
TargetGalectin-7
LigandBDBM50273432
Substrate/Competitorn/a
Meas. Tech.ChEMBL_560913 (CHEMBL1013548)
Kd 190000±n/a nM
Citation Delaine, TCumpstey, IIngrassia, LLe Mercier, MOkechukwu, PLeffler, HKiss, RNilsson, UJ Galectin-inhibitory thiodigalactoside ester derivatives have antimigratory effects in cultured lung and prostate cancer cells. J Med Chem51:8109-14 (2008) 
 
Galectin-7
Name:Galectin-7
Type:Galactoside-binding protein
Mol. Mass.:15077.89
Organism:Homo sapiens (Human)
Description:n/a
Residue:136
BDBM50273432
NameBDBM50273432
Synonyms:Bis-[3-O-(4-methylbenzoyl)-beta-D-galactopyranosyl]sulfane | CHEMBL505576
TypeSmall organic molecule
Emp. Form.C28H34O12S
Mol. Mass.594.627
SMILESCc1ccc(cc1)C(=O)O[C@H]1[C@@H](O)[C@@H](CO)O[C@@H](S[C@@H]2O[C@H](CO)[C@H](O)[C@H](OC(=O)c3ccc(C)cc3)[C@H]2O)[C@@H]1O