Reaction Details
TargetGalectin-7
LigandBDBM50273580
Substrate/Competitorn/a
Meas. Tech.ChEMBL_560913 (CHEMBL1013548)
Kd 2100±n/a nM
Citation Delaine, TCumpstey, IIngrassia, LLe Mercier, MOkechukwu, PLeffler, HKiss, RNilsson, UJ Galectin-inhibitory thiodigalactoside ester derivatives have antimigratory effects in cultured lung and prostate cancer cells. J Med Chem51:8109-14 (2008) 
 
Galectin-7
Name:Galectin-7
Type:Galactoside-binding protein
Mol. Mass.:15077.89
Organism:Homo sapiens (Human)
Description:n/a
Residue:136
BDBM50273580
NameBDBM50273580
Synonyms:CHEMBL503116 | N-[(2S,3R,4S,5R,6R)-2-{[(2S,3R,4S,5R,6R)-3,5-dihydroxy-6-(hydroxymethyl)-4-[(3-methoxybenzene)amido]oxan-2-yl]sulfanyl}-3,5-dihydroxy-6-(hydroxymethyl)oxan-4-yl]-3-methoxybenzamide
TypeSmall organic molecule
Emp. Form.C28H36N2O12S
Mol. Mass.624.657
SMILESCOc1cccc(c1)C(=O)N[C@H]1[C@@H](O)[C@@H](CO)O[C@@H](S[C@@H]2O[C@H](CO)[C@H](O)[C@H](NC(=O)c3cccc(OC)c3)[C@H]2O)[C@@H]1O