Reaction Details
TargetGalectin-8
LigandBDBM50273434
Substrate/Competitorn/a
Meas. Tech.ChEMBL_560907 (CHEMBL1013542)
Kd 100000±n/a nM
Citation Delaine, TCumpstey, IIngrassia, LLe Mercier, MOkechukwu, PLeffler, HKiss, RNilsson, UJ Galectin-inhibitory thiodigalactoside ester derivatives have antimigratory effects in cultured lung and prostate cancer cells. J Med Chem51:8109-14 (2008) 
 
Galectin-8
Name:Galectin-8
Type:PROTEIN
Mol. Mass.:35814.23
Organism:Homo sapiens (Human)
Description:ChEMBL_1454625
Residue:317
BDBM50273434
NameBDBM50273434
Synonyms:Bis-(3-O-2-naphthoyl-beta-D-galactopyranosyl)sulfane | CHEMBL443156
TypeSmall organic molecule
Emp. Form.C34H34O12S
Mol. Mass.666.692
SMILESOC[C@H]1O[C@@H](S[C@@H]2O[C@H](CO)[C@H](O)[C@H](OC(=O)c3ccc4ccccc4c3)[C@H]2O)[C@H](O)[C@@H](OC(=O)c2ccc3ccccc3c2)[C@H]1O