Reaction Details
TargetLysophosphatidylserine lipase ABHD12
LigandBDBM50240877
Substrate/Competitorn/a
Meas. Tech.ChEMBL_557684 (CHEMBL962979)
IC50>100000±n/a nM
Citation Hoover, HSBlankman, JLNiessen, SCravatt, BF Selectivity of inhibitors of endocannabinoid biosynthesis evaluated by activity-based protein profiling. Bioorg Med Chem Lett18:5838-41 (2008) 
 
Lysophosphatidylserine lipase ABHD12
Name:Lysophosphatidylserine lipase ABHD12
Type:PROTEIN
Mol. Mass.:45111.32
Organism:Homo sapiens (Human)
Description:ChEMBL_1514755
Residue:398
BDBM50240877
NameBDBM50240877
Synonyms:CHEMBL158897 cyclohexanone O-6-((cyclohexylideneaminooxy)carbonylamino)hexylcarbamoyl oxime
TypeSmall organic molecule
Emp. Form.C20H34N4O4
Mol. Mass.394.5084
SMILESO=[#6](-[#7]-[#6]-[#6]-[#6]-[#6]-[#6]-[#6]-[#7]-[#6](=O)-[#8]\[#7]=[#6]-1\[#6]-[#6]-[#6]-[#6]-[#6]-1)-[#8]\[#7]=[#6]-1\[#6]-[#6]-[#6]-[#6]-[#6]-1