Reaction Details
TargetPurine nucleoside phosphorylase
LigandBDBM50246591
Substrate/Competitorn/a
Meas. Tech.ChEMBL_557942 (CHEMBL963040)
Ki 5.8±n/a nM
Citation Murkin, ASClinch, KMason, JMTyler, PCSchramm, VL Immucillins in custom catalytic-site cavities. Bioorg Med Chem Lett18:5900-3 (2008) 
 
Purine nucleoside phosphorylase
Name:Purine nucleoside phosphorylase
Type:Enzyme
Mol. Mass.:32119.53
Organism:Homo sapiens (Human)
Description:n/a
Residue:289
BDBM50246591
NameBDBM50246591
Synonyms:(+/-)-5'-deoxy-4'-fluoro-5'-methylthio-DADMe-ImmH | CHEMBL461527
TypeSmall organic molecule
Emp. Form.C13H17FN4O2S
Mol. Mass.312.363
SMILESCSC[C@@]1(F)CN(Cc2c[nH]c3c2nc[nH]c3=O)C[C@@H]1O