Reaction Details
TargetPurine nucleoside phosphorylase
LigandBDBM50247151
Substrate/Competitorn/a
Meas. Tech.ChEMBL_557943 (CHEMBL963041)
Ki 0.0196±n/a nM
Citation Murkin, ASClinch, KMason, JMTyler, PCSchramm, VL Immucillins in custom catalytic-site cavities. Bioorg Med Chem Lett18:5900-3 (2008) 
 
Purine nucleoside phosphorylase
Name:Purine nucleoside phosphorylase
Type:Enzyme
Mol. Mass.:32119.53
Organism:Homo sapiens (Human)
Description:n/a
Residue:289
BDBM50247151
NameBDBM50247151
Synonyms:7-(((3R,4S)-3-hydroxy-4-(methylthiomethyl)pyrrolidin-1-yl)methyl)-3H-pyrrolo[3,2-d]pyrimidin-4(5H)-one US9290501, (C)
TypeSmall organic molecule
Emp. Form.C13H18N4O2S
Mol. Mass.294.373
SMILESCSC[C@H]1CN(Cc2c[nH]c3c2nc[nH]c3=O)C[C@@H]1O