Reaction Details
TargetKappa-type opioid receptor
LigandBDBM50245894
Substrate/Competitorn/a
Meas. Tech.ChEMBL_559165 (CHEMBL1012110)
IC50 0.303±n/a nM
Citation Nemoto, TFujii, HNarita, MMiyoshi, KNakamura, ASuzuki, TNagase, H Synthesis of a novel 6,14-epoxymorphinan derivative and its pharmacology. Bioorg Med Chem Lett18:6398-401 (2008) 
 
Kappa-type opioid receptor
Name:Kappa-type opioid receptor
Type:G Protein-Coupled Receptor (GPCR)
Mol. Mass.:42744.99
Organism:Cavia porcellus (domestic guinea pig)
Description:P41144
Residue:380
BDBM50245894
NameBDBM50245894
Synonyms:CHEMBL461313 | N-{[(1R,9S,10S,13R)-17-(cyclopropylmethyl)-4-hydroxy-18-oxa-17-azapentacyclo[7.5.3.1^{10,13}.0^{1,10}.0^{2,7}]octadeca-2(7),3,5-trien-13-yl]methyl}benzamide
TypeSmall organic molecule
Emp. Form.C28H32N2O3
Mol. Mass.444.5653
SMILESOc1ccc2C[C@@H]3N(CC4CC4)CC[C@@]4(C[C@@]5(CNC(=O)c6ccccc6)CC[C@@]34O5)c2c1