Reaction Details
Target3-oxoacyl-[acyl-carrier-protein] synthase 3
LigandBDBM50245878
Substrate/Competitorn/a
Meas. Tech.ChEMBL_559691 (CHEMBL1010089)
IC50 3.76±n/a nM
Citation Alhamadsheh, MMWaters, NCSachdeva, SLee, PReynolds, KA Synthesis and biological evaluation of novel sulfonyl-naphthalene-1,4-diols as FabH inhibitors. Bioorg Med Chem Lett18:6402-5 (2008) 
 
3-oxoacyl-[acyl-carrier-protein] synthase 3
Name:3-oxoacyl-[acyl-carrier-protein] synthase 3
Type:Enzyme
Mol. Mass.:34865.07
Organism:Mycobacterium tuberculosis
Description:P9WNG3
Residue:335
BDBM50245878
NameBDBM50245878
Synonyms:CHEMBL512926 | N-(4-(1,4-dihydroxynaphthalen-2-ylsulfonyl)phenyl)acetamide
TypeSmall organic molecule
Emp. Form.C18H15NO5S
Mol. Mass.357.38
SMILESCC(=O)Nc1ccc(cc1)S(=O)(=O)c1cc(O)c2ccccc2c1O