Reaction Details
Target3-oxoacyl-[acyl-carrier-protein] synthase 3
LigandBDBM50245879
Substrate/Competitorn/a
Meas. Tech.ChEMBL_559691 (CHEMBL1010089)
IC50 3.61±n/a nM
Citation Alhamadsheh, MMWaters, NCSachdeva, SLee, PReynolds, KA Synthesis and biological evaluation of novel sulfonyl-naphthalene-1,4-diols as FabH inhibitors. Bioorg Med Chem Lett18:6402-5 (2008) 
 
3-oxoacyl-[acyl-carrier-protein] synthase 3
Name:3-oxoacyl-[acyl-carrier-protein] synthase 3
Type:Enzyme
Mol. Mass.:34865.07
Organism:Mycobacterium tuberculosis
Description:P9WNG3
Residue:335
BDBM50245879
NameBDBM50245879
Synonyms:2-(4-chlorophenylsulfonyl)naphthalene-1,4-diol | CHEMBL460104
TypeSmall organic molecule
Emp. Form.C16H11ClO4S
Mol. Mass.334.774
SMILESOc1cc(c(O)c2ccccc12)S(=O)(=O)c1ccc(Cl)cc1