Reaction Details
Target3-oxoacyl-[acyl-carrier-protein] synthase 3
LigandBDBM50245880
Substrate/Competitorn/a
Meas. Tech.ChEMBL_559691 (CHEMBL1010089)
IC50 3.09±n/a nM
Citation Alhamadsheh, MMWaters, NCSachdeva, SLee, PReynolds, KA Synthesis and biological evaluation of novel sulfonyl-naphthalene-1,4-diols as FabH inhibitors. Bioorg Med Chem Lett18:6402-5 (2008) 
 
3-oxoacyl-[acyl-carrier-protein] synthase 3
Name:3-oxoacyl-[acyl-carrier-protein] synthase 3
Type:Enzyme
Mol. Mass.:34865.07
Organism:Mycobacterium tuberculosis
Description:P9WNG3
Residue:335
BDBM50245880
NameBDBM50245880
Synonyms:2-(4-propylphenylsulfonyl)naphthalene-1,4-diol | CHEMBL445555
TypeSmall organic molecule
Emp. Form.C19H18O4S
Mol. Mass.342.409
SMILESCCCc1ccc(cc1)S(=O)(=O)c1cc(O)c2ccccc2c1O