Reaction Details
TargetCalcitonin gene-related peptide type 1 receptor
LigandBDBM50254446
Substrate/Competitorn/a
Meas. Tech.ChEMBL_560218 (CHEMBL1015393)
Ki 0.51±n/a nM
Citation Stump, CABell, IMBednar, RABruno, JGFay, JFGallicchio, SNJohnston, VKMoore, ELMosser, SDQuigley, AGSalvatore, CATheberge, CRBlair Zartman, CZhang, XFKane, SAGraham, SLVacca, JPWilliams, TM The discovery of highly potent CGRP receptor antagonists. Bioorg Med Chem Lett19:214-7 (2008) 
 
Calcitonin gene-related peptide type 1 receptor
Name:Calcitonin gene-related peptide type 1 receptor
Type:Enzyme Catalytic Domain
Mol. Mass.:52980.45
Organism:Homo sapiens (Human)
Description:Q16602
Residue:461
BDBM50254446
NameBDBM50254446
Synonyms:(R)-N-(3-methyl-2,5-dioxo-1',3'-dihydrospiro[imidazolidine-4,2'-indene]-5'-yl)-2-(8-methyl-2,5-dioxo-2,4,5,6-tetrahydro-1H-imidazo[1,5,4-de]quinoxalin-1-yl)acetamide CHEMBL466192
TypeSmall organic molecule
Emp. Form.C24H22N6O5
Mol. Mass.474.4687
SMILESCN1C(=O)NC(=O)[C@]11Cc2ccc(NC(=O)Cn3c4cc(C)cc5NC(=O)Cn(c45)c3=O)cc2C1