Reaction Details
TargetCalcitonin gene-related peptide type 1 receptor
LigandBDBM50255035
Substrate/Competitorn/a
Meas. Tech.ChEMBL_560218 (CHEMBL1015393)
Ki 2.3±n/a nM
Citation Stump, CABell, IMBednar, RABruno, JGFay, JFGallicchio, SNJohnston, VKMoore, ELMosser, SDQuigley, AGSalvatore, CATheberge, CRBlair Zartman, CZhang, XFKane, SAGraham, SLVacca, JPWilliams, TM The discovery of highly potent CGRP receptor antagonists. Bioorg Med Chem Lett19:214-7 (2008) 
 
Calcitonin gene-related peptide type 1 receptor
Name:Calcitonin gene-related peptide type 1 receptor
Type:Enzyme Catalytic Domain
Mol. Mass.:52980.45
Organism:Homo sapiens (Human)
Description:Q16602
Residue:461
BDBM50255035
NameBDBM50255035
Synonyms:(S)-N-(2'-oxo-1,1',2',3-tetrahydrospiro[indene-2,3'-pyrrolo[2,3-b]pyridine]-5-yl)-2-(2-oxo-3-(pyridin-2-yl)-2,3-dihydro-1H-benzo[d]imidazol-1-yl)acetamide | CHEMBL465934
TypeSmall organic molecule
Emp. Form.C29H22N6O3
Mol. Mass.502.5234
SMILESO=C(Cn1c2ccccc2n(-c2ccccn2)c1=O)Nc1ccc2C[C@@]3(Cc2c1)C(=O)Nc1ncccc31