Reaction Details
TargetSodium-dependent noradrenaline transporter
LigandBDBM50254830
Substrate/Competitorn/a
Meas. Tech.ChEMBL_560772 (CHEMBL1011739)
IC50 6811±n/a nM
Citation Cashman, JRVoelker, TJohnson, RJanowsky, A Stereoselective inhibition of serotonin re-uptake and phosphodiesterase by dual inhibitors as potential agents for depression. Bioorg Med Chem17:337-43 (2008) 
 
Sodium-dependent noradrenaline transporter
Name:Sodium-dependent noradrenaline transporter
Type:Multi-pass membrane protein
Mol. Mass.:69337.72
Organism:Homo sapiens (Human)
Description:P23975
Residue:617
BDBM50254830
NameBDBM50254830
Synonyms:4-(3,4-dimethoxyphenyl)-2-(5-((R)-3-phenyl-3-(4-(trifluoromethyl)phenoxy)propylamino)pentyl)-4a,5,8,8a-tetrahydrophthalazin-1(2H)-one | CHEMBL499461
TypeSmall organic molecule
Emp. Form.C37H42F3N3O4
Mol. Mass.649.7423
SMILESCOc1ccc(cc1OC)C1=NN(CCCCCNCC[C@@H](Oc2ccc(cc2)C(F)(F)F)c2ccccc2)C(=O)C2CC=CCC12