Reaction Details
TargetSodium-dependent serotonin transporter
LigandBDBM50254829
Substrate/Competitorn/a
Meas. Tech.ChEMBL_560768 (CHEMBL1011735)
Ki 300±n/a nM
Citation Cashman, JRVoelker, TJohnson, RJanowsky, A Stereoselective inhibition of serotonin re-uptake and phosphodiesterase by dual inhibitors as potential agents for depression. Bioorg Med Chem17:337-43 (2008) 
 
Sodium-dependent serotonin transporter
Name:Sodium-dependent serotonin transporter
Type:Multi-pass membrane protein
Mol. Mass.:70322.51
Organism:Homo sapiens (Human)
Description:P31645
Residue:630
BDBM50254829
NameBDBM50254829
Synonyms:4-(3,4-dimethoxyphenyl)-2-(5-((S)-3-phenyl-3-(4-(trifluoromethyl)phenoxy)propylamino)pentyl)-4a,5,8,8a-tetrahydrophthalazin-1(2H)-one | CHEMBL454507
TypeSmall organic molecule
Emp. Form.C37H42F3N3O4
Mol. Mass.649.7423
SMILESCOc1ccc(cc1OC)C1=NN(CCCCCNCC[C@H](Oc2ccc(cc2)C(F)(F)F)c2ccccc2)C(=O)C2CC=CCC12