Reaction Details
TargetSodium-dependent noradrenaline transporter
LigandBDBM50254791
Substrate/Competitorn/a
Meas. Tech.ChEMBL_560769 (CHEMBL1011736)
Ki 7490±n/a nM
Citation Cashman, JRVoelker, TJohnson, RJanowsky, A Stereoselective inhibition of serotonin re-uptake and phosphodiesterase by dual inhibitors as potential agents for depression. Bioorg Med Chem17:337-43 (2008) 
 
Sodium-dependent noradrenaline transporter
Name:Sodium-dependent noradrenaline transporter
Type:Multi-pass membrane protein
Mol. Mass.:69337.72
Organism:Homo sapiens (Human)
Description:P23975
Residue:617
BDBM50254791
NameBDBM50254791
Synonyms:(R)-Norfluoxetine | CHEMBL446084
TypeSmall organic molecule
Emp. Form.C16H16F3NO
Mol. Mass.295.2995
SMILESNCC[C@@H](Oc1ccc(cc1)C(F)(F)F)c1ccccc1