Reaction Details
TargetDelta-type opioid receptor
LigandBDBM50128411
Substrate/Competitorn/a
Meas. Tech.ChEMBL_558748 (CHEMBL1019877)
Ki 550±n/a nM
Citation Wentland, MPLou, RLu, QBu, YVanAlstine, MACohen, DJBidlack, JM Syntheses and opioid receptor binding properties of carboxamido-substituted opioids. Bioorg Med Chem Lett19:203-8 (2008) 
 
Delta-type opioid receptor
Name:Delta-type opioid receptor
Type:G Protein-Coupled Receptor (GPCR)
Mol. Mass.:40382.98
Organism:Homo sapiens (Human)
Description:Competition binding assays were carried out using membrane preparations from transfected HN9.10 cells that constitutively expressed the delta opioid receptor.
Residue:372
BDBM50128411
NameBDBM50128411
Synonyms:3-desoxy-3-carboxamidonaltrexone CHEMBL56695
TypeSmall organic molecule
Emp. Form.C21H24N2O4
Mol. Mass.368.4263
SMILESNC(=O)c1ccc2C[C@H]3N(CC4CC4)CC[C@@]45[C@@H](Oc1c24)C(=O)CC[C@@]35O