Reaction Details
TargetMu-type opioid receptor
LigandBDBM50254514
Substrate/Competitorn/a
Meas. Tech.ChEMBL_558759 (CHEMBL1019888)
IC50 4±n/a nM
Citation Wentland, MPLou, RLu, QBu, YVanAlstine, MACohen, DJBidlack, JM Syntheses and opioid receptor binding properties of carboxamido-substituted opioids. Bioorg Med Chem Lett19:203-8 (2008) 
 
Mu-type opioid receptor
Name:Mu-type opioid receptor
Type:G Protein-Coupled Receptor (GPCR)
Mol. Mass.:44789.51
Organism:Homo sapiens (Human)
Description:P35372
Residue:400
BDBM50254514
NameBDBM50254514
Synonyms:(1S,2R,6S,14R,15S,16R)-3-(cyclopropylmethyl)-16-[(2R)-2-hydroxy-3,3-dimethylbutan-2-yl]-15-methoxy-13-oxa-3-azahexacyclo[13.2.2.1^{2,8}.0^{1,6}.0^{6,14}.0^{7,12}]icosa-7(12),8,10-triene-11-carboxamide | CHEMBL517567
TypeSmall organic molecule
Emp. Form.C30H42N2O4
Mol. Mass.494.6655
SMILESCO[C@@]12CC[C@@]3(C[C@@H]1[C@@](C)(O)C(C)(C)C)[C@H]1Cc4ccc(C(N)=O)c5O[C@@H]2[C@]3(CCN1CC1CC1)c45