Reaction Details
TargetMu-type opioid receptor
LigandBDBM50367062
Substrate/Competitorn/a
Meas. Tech.ChEMBL_558747 (CHEMBL1019876)
Ki 3.8±n/a nM
Citation Wentland, MPLou, RLu, QBu, YVanAlstine, MACohen, DJBidlack, JM Syntheses and opioid receptor binding properties of carboxamido-substituted opioids. Bioorg Med Chem Lett19:203-8 (2008) 
 
Mu-type opioid receptor
Name:Mu-type opioid receptor
Type:G Protein-Coupled Receptor (GPCR)
Mol. Mass.:44789.51
Organism:Homo sapiens (Human)
Description:P35372
Residue:400
BDBM50367062
NameBDBM50367062
Synonyms:METAZOCINE
TypeSmall organic molecule
Emp. Form.C15H21NO
Mol. Mass.231.3333
SMILESC[C@H]1[C@@H]2Cc3ccc(O)cc3[C@]1(C)CCN2C