Reaction Details
TargetMu-type opioid receptor
LigandBDBM50001033
Substrate/Competitorn/a
Meas. Tech.ChEMBL_558747 (CHEMBL1019876)
Ki 6.9±n/a nM
Citation Wentland, MPLou, RLu, QBu, YVanAlstine, MACohen, DJBidlack, JM Syntheses and opioid receptor binding properties of carboxamido-substituted opioids. Bioorg Med Chem Lett19:203-8 (2008) 
 
Mu-type opioid receptor
Name:Mu-type opioid receptor
Type:G Protein-Coupled Receptor (GPCR)
Mol. Mass.:44789.51
Organism:Homo sapiens (Human)
Description:P35372
Residue:400
BDBM50001033
NameBDBM50001033
Synonyms:(-)-Pentazocine REL-PENTAZOCINE
TypeSmall organic molecule
Emp. Form.C19H27NO
Mol. Mass.285.4238
SMILES[H][C@]12[#6]-c3ccc(-[#8])cc3[C@]([#6])([#6]-[#6]-[#7]1-[#6]\[#6]=[#6](/[#6])-[#6])[#6@@H]2-[#6]