Reaction Details
TargetKappa-type opioid receptor
LigandBDBM50254516
Substrate/Competitorn/a
Meas. Tech.ChEMBL_558760 (CHEMBL1019889)
Ki 350±n/a nM
Citation Wentland, MPLou, RLu, QBu, YVanAlstine, MACohen, DJBidlack, JM Syntheses and opioid receptor binding properties of carboxamido-substituted opioids. Bioorg Med Chem Lett19:203-8 (2008) 
 
Kappa-type opioid receptor
Name:Kappa-type opioid receptor
Type:G Protein-Coupled Receptor (GPCR)
Mol. Mass.:42648.76
Organism:Homo sapiens (Human)
Description:P41145
Residue:380
BDBM50254516
NameBDBM50254516
Synonyms:CHEMBL443601 | rel-3-((1R,2R)-2-((dimethylamino)methyl)-1-hydroxycyclohexyl)benzamide
TypeSmall organic molecule
Emp. Form.C16H24N2O2
Mol. Mass.276.374
SMILESCN(C)C[C@H]1CCCC[C@]1(O)c1cccc(c1)C(N)=O