Reaction Details
TargetMu-type opioid receptor
LigandBDBM50254515
Substrate/Competitorn/a
Meas. Tech.ChEMBL_558757 (CHEMBL1019886)
Ki 400±n/a nM
Citation Wentland, MPLou, RLu, QBu, YVanAlstine, MACohen, DJBidlack, JM Syntheses and opioid receptor binding properties of carboxamido-substituted opioids. Bioorg Med Chem Lett19:203-8 (2008) 
 
Mu-type opioid receptor
Name:Mu-type opioid receptor
Type:G Protein-Coupled Receptor (GPCR)
Mol. Mass.:44789.51
Organism:Homo sapiens (Human)
Description:P35372
Residue:400
BDBM50254515
NameBDBM50254515
Synonyms:(1S,2S,7S,8R,12S,20R,24R,32R)-9,33-bis(cyclopropylmethyl)-2,7-dihydroxy-19,25-dioxa-9,22,33-triazaundecacyclo[24.9.1.1^{8,14}.0^{1,24}.0^{2,32}.0^{4,23}.0^{5,21}.0^{7,12}.0^{12,20}.0^{13,18}.0^{30,36}]heptatriaconta-13(18),14,16,26(36),27,29-hexaene-17,27-dicarboxamide | CHEMBL506457
TypeSmall organic molecule
Emp. Form.C42H49N5O6
Mol. Mass.719.8684
SMILESNC(=O)c1ccc2C[C@H]3N(CC4CC4)CC[C@@]45[C@@H](Oc1c24)C1NC2C(C[C@@]4(O)[C@H]6Cc7ccc(C(N)=O)c8O[C@@H]2[C@]4(CCN6CC2CC2)c78)C1C[C@@]35O