Reaction Details
TargetMu-type opioid receptor
LigandBDBM50367061
Substrate/Competitorn/a
Meas. Tech.ChEMBL_558757 (CHEMBL1019886)
Ki 0.190000±n/a nM
Citation Wentland, MPLou, RLu, QBu, YVanAlstine, MACohen, DJBidlack, JM Syntheses and opioid receptor binding properties of carboxamido-substituted opioids. Bioorg Med Chem Lett19:203-8 (2008) 
 
Mu-type opioid receptor
Name:Mu-type opioid receptor
Type:G Protein-Coupled Receptor (GPCR)
Mol. Mass.:44789.51
Organism:Homo sapiens (Human)
Description:P35372
Residue:400
BDBM50367061
NameBDBM50367061
Synonyms:NALORPHINE | NALORPHINE HYDROCHLORIDE
TypeSmall organic molecule
Emp. Form.C19H21NO3
Mol. Mass.311.3749
SMILESO[C@H]1C=C[C@H]2[C@H]3Cc4ccc(O)c5O[C@@H]1[C@]2(CCN3CC=C)c45