Reaction Details
TargetMu-type opioid receptor
LigandBDBM50254565
Substrate/Competitorn/a
Meas. Tech.ChEMBL_558757 (CHEMBL1019886)
EC50 24±n/a nM
Citation Wentland, MPLou, RLu, QBu, YVanAlstine, MACohen, DJBidlack, JM Syntheses and opioid receptor binding properties of carboxamido-substituted opioids. Bioorg Med Chem Lett19:203-8 (2008) 
 
Mu-type opioid receptor
Name:Mu-type opioid receptor
Type:G Protein-Coupled Receptor (GPCR)
Mol. Mass.:44789.51
Organism:Homo sapiens (Human)
Description:P35372
Residue:400
BDBM50254565
NameBDBM50254565
Synonyms:3,6,11-Trimethyl-1,2,3,4,5,6-hexahydro-2,6-methano-benzo[d]azocine-8-carboxylic acid amide | CHEMBL511884
TypeSmall organic molecule
Emp. Form.C16H22N2O
Mol. Mass.258.3587
SMILESCC1C2Cc3ccc(cc3C1(C)CCN2C)C(N)=O