Reaction Details
TargetMu-type opioid receptor
LigandBDBM50254568
Substrate/Competitorn/a
Meas. Tech.ChEMBL_558752 (CHEMBL1019881)
Ki 0.052000±n/a nM
Citation Wentland, MPLou, RLu, QBu, YVanAlstine, MACohen, DJBidlack, JM Syntheses and opioid receptor binding properties of carboxamido-substituted opioids. Bioorg Med Chem Lett19:203-8 (2008) 
 
Mu-type opioid receptor
Name:Mu-type opioid receptor
Type:Enzyme Catalytic Domain
Mol. Mass.:11165.58
Organism:GUINEA PIG
Description:P97266
Residue:98
BDBM50254568
NameBDBM50254568
Synonyms:(2S,6S,11S)-6,11-Dimethyl-3-[(S)-1-(tetrahydro-furan-2-yl)methyl]-1,2,3,4,5,6-hexahydro-2,6-methano-benzo[d]azocine-8-carboxylic acid amide | CHEMBL517166
TypeSmall organic molecule
Emp. Form.C20H28N2O2
Mol. Mass.328.4485
SMILESC[C@@H]1[C@@H]2Cc3ccc(cc3[C@@]1(C)CCN2C[C@@H]1CCCO1)C(N)=O