Reaction Details
TargetMu-type opioid receptor
LigandBDBM50254510
Substrate/Competitorn/a
Meas. Tech.ChEMBL_558757 (CHEMBL1019886)
EC50 4.2±n/a nM
Citation Wentland, MPLou, RLu, QBu, YVanAlstine, MACohen, DJBidlack, JM Syntheses and opioid receptor binding properties of carboxamido-substituted opioids. Bioorg Med Chem Lett19:203-8 (2008) 
 
Mu-type opioid receptor
Name:Mu-type opioid receptor
Type:G Protein-Coupled Receptor (GPCR)
Mol. Mass.:44789.51
Organism:Homo sapiens (Human)
Description:P35372
Residue:400
BDBM50254510
NameBDBM50254510
Synonyms:3-Cyclopropylmethyl-6,11-dimethyl-1-oxo-1,2,3,4,5,6-hexahydro-2,6-methano-benzo[d]azocine-8-carboxylic acid amide | CHEMBL511691
TypeSmall organic molecule
Emp. Form.C19H24N2O2
Mol. Mass.312.4061
SMILESCC1C2N(CC3CC3)CCC1(C)c1cc(ccc1C2=O)C(N)=O