Reaction Details
TargetKappa-type opioid receptor
LigandBDBM50240437
Substrate/Competitorn/a
Meas. Tech.ChEMBL_558760 (CHEMBL1019889)
Ki 0.220000±n/a nM
Citation Wentland, MPLou, RLu, QBu, YVanAlstine, MACohen, DJBidlack, JM Syntheses and opioid receptor binding properties of carboxamido-substituted opioids. Bioorg Med Chem Lett19:203-8 (2008) 
 
Kappa-type opioid receptor
Name:Kappa-type opioid receptor
Type:G Protein-Coupled Receptor (GPCR)
Mol. Mass.:42648.76
Organism:Homo sapiens (Human)
Description:P41145
Residue:380
BDBM50240437
NameBDBM50240437
Synonyms:(-)-17-(cyclobutylmethyl)morphinan-3,14-diol (-)-butorphanol BUTORPHANOL US10231963, Table B.3 US11534436, Compound Table B.3 | US9656961, Example 00120
TypeSmall organic molecule
Emp. Form.C21H29NO2
Mol. Mass.327.4605
SMILESOc1ccc2C[C@H]3N(CC4CCC4)CC[C@@]4(CCCC[C@@]34O)c2c1