Reaction Details
TargetSomatostatin receptor type 4
LigandBDBM50254255
Substrate/Competitorn/a
Meas. Tech.ChEMBL_560341 (CHEMBL1009181)
IC50 1±n/a nM
Citation Feytens, DDe Vlaeminck, MCescato, RTourwé, DReubi, JC Highly potent 4-amino-indolo[2,3-c]azepin-3-one-containing somatostatin mimetics with a range of sst receptor selectivities. J Med Chem52:95-104 (2009) 
 
Somatostatin receptor type 4
Name:Somatostatin receptor type 4
Type:Enzyme
Mol. Mass.:42015.38
Organism:Homo sapiens (Human)
Description:P31391
Residue:388
BDBM50254255
NameBDBM50254255
Synonyms:(5S)-6-oxo-5-[(4R)-3-oxo-4-[(phenylacetyl)amino]-3,4,5,10-tetrahydroazepino[3,4-b]indol-2(1H)-yl]-6-{[(1S)-1-phenylethyl]amino}hexan-1-aminium trifluoroacetate | CHEMBL466609
TypeSmall organic molecule
Emp. Form.C34H39N5O3
Mol. Mass.565.7052
SMILESC[C@H](NC(=O)[C@H](CCCCN)N1Cc2[nH]c3ccccc3c2C[C@@H](NC(=O)Cc2ccccc2)C1=O)c1ccccc1