Reaction Details
TargetCannabinoid receptor 2
LigandBDBM50265645
Substrate/Competitorn/a
Meas. Tech.ChEMBL_559545 (CHEMBL1019848)
EC50 14.7±n/a nM
Citation Diaz, PPhatak, SSXu, JAstruc-Diaz, FCavasotto, CNNaguib, M 6-Methoxy-N-alkyl isatin acylhydrazone derivatives as a novel series of potent selective cannabinoid receptor 2 inverse agonists: design, synthesis, and binding mode prediction. J Med Chem52:433-44 (2009) 
 
Cannabinoid receptor 2
Name:Cannabinoid receptor 2
Type:G Protein-Coupled Receptor (GPCR)
Mol. Mass.:39690.94
Organism:Homo sapiens (Human)
Description:P34972
Residue:360
BDBM50265645
NameBDBM50265645
Synonyms:2-Hydroxy-N'-[(3Z)-6-methoxy-1-pentyl-2-oxo-1,2-dihydro-3H-indol-3-ylidene]-2-methylpropanohydrazide | CHEMBL498765
TypeSmall organic molecule
Emp. Form.C18H25N3O4
Mol. Mass.347.4088
SMILESCCCCCN1C(=O)C(=NNC(=O)C(C)(C)O)c2ccc(OC)cc12