Reaction Details
TargetCannabinoid receptor 2
LigandBDBM50265741
Substrate/Competitorn/a
Meas. Tech.ChEMBL_559554 (CHEMBL1019857)
EC50 2.2±n/a nM
Citation Diaz, PPhatak, SSXu, JAstruc-Diaz, FCavasotto, CNNaguib, M 6-Methoxy-N-alkyl isatin acylhydrazone derivatives as a novel series of potent selective cannabinoid receptor 2 inverse agonists: design, synthesis, and binding mode prediction. J Med Chem52:433-44 (2009) 
 
Cannabinoid receptor 2
Name:Cannabinoid receptor 2
Type:G Protein-Coupled Receptor (GPCR)
Mol. Mass.:39690.94
Organism:Homo sapiens (Human)
Description:P34972
Residue:360
BDBM50265741
NameBDBM50265741
Synonyms:CHEMBL523727 | N-(1-(cyclohexylmethyl)-2-((2,3-dihydrobenzofuran-5-yl)methyl)-1H-benzo[d]imidazol-5-yl)-N-methylbenzenesulfonamide
TypeSmall organic molecule
Emp. Form.C30H33N3O3S
Mol. Mass.515.666
SMILESCN(c1ccc2n(CC3CCCCC3)c(Cc3ccc4OCCc4c3)nc2c1)S(=O)(=O)c1ccccc1