Reaction Details
TargetCannabinoid receptor 1
LigandBDBM50265757
Substrate/Competitorn/a
Meas. Tech.ChEMBL_560594 (CHEMBL1022319)
Ki>10000±n/a nM
Citation Markt, PFeldmann, CRollinger, JMRaduner, SSchuster, DKirchmair, JDistinto, SSpitzer, GMWolber, GLaggner, CAltmann, KHLanger, TGertsch, J Discovery of novel CB2 receptor ligands by a pharmacophore-based virtual screening workflow. J Med Chem52:369-78 (2009) 
 
Cannabinoid receptor 1
Name:Cannabinoid receptor 1
Type:G Protein-Coupled Receptor (GPCR)
Mol. Mass.:52868.96
Organism:Homo sapiens (Human)
Description:P21554
Residue:472
BDBM50265757
NameBDBM50265757
Synonyms:4-(2,6-dimethoxy-4-(2-methyloctan-2-yl)phenyl)tetrahydro-2H-pyran-4-ol | CHEMBL495546
TypeSmall organic molecule
Emp. Form.C22H36O4
Mol. Mass.364.5188
SMILESCCCCCCC(C)(C)c1cc(OC)c(c(OC)c1)C1(O)CCOCC1