Reaction Details
TargetCannabinoid receptor 2
LigandBDBM50265621
Substrate/Competitorn/a
Meas. Tech.ChEMBL_560598 (CHEMBL1009870)
Ki 22.7±n/a nM
Citation Markt, PFeldmann, CRollinger, JMRaduner, SSchuster, DKirchmair, JDistinto, SSpitzer, GMWolber, GLaggner, CAltmann, KHLanger, TGertsch, J Discovery of novel CB2 receptor ligands by a pharmacophore-based virtual screening workflow. J Med Chem52:369-78 (2009) 
 
Cannabinoid receptor 2
Name:Cannabinoid receptor 2
Type:G Protein-Coupled Receptor (GPCR)
Mol. Mass.:39690.94
Organism:Homo sapiens (Human)
Description:P34972
Residue:360
BDBM50265621
NameBDBM50265621
Synonyms:((1R,4S,5R)-4-(2,6-dimethoxy-4-(2-methyloctan-2-yl)phenyl)-6,6-dimethylbicyclo[3.1.1]hept-2-en-2-yl)methanol CHEMBL497392 | HU-308
TypeSmall organic molecule
Emp. Form.C27H42O3
Mol. Mass.414.6206
SMILESCCCCCCC(C)(C)c1cc(OC)c([C@H]2C=C(CO)[C@@H]3C[C@H]2C3(C)C)c(OC)c1