Reaction Details
TargetCannabinoid receptor 2
LigandBDBM50265648
Substrate/Competitorn/a
Meas. Tech.ChEMBL_560595 (CHEMBL1022320)
Ki 1.78±n/a nM
Citation Markt, PFeldmann, CRollinger, JMRaduner, SSchuster, DKirchmair, JDistinto, SSpitzer, GMWolber, GLaggner, CAltmann, KHLanger, TGertsch, J Discovery of novel CB2 receptor ligands by a pharmacophore-based virtual screening workflow. J Med Chem52:369-78 (2009) 
 
Cannabinoid receptor 2
Name:Cannabinoid receptor 2
Type:G Protein-Coupled Receptor (GPCR)
Mol. Mass.:39690.94
Organism:Homo sapiens (Human)
Description:P34972
Residue:360
BDBM50265648
NameBDBM50265648
Synonyms:8-hexyl-3,5,5-trimethyl-2,3,4,5-tetrahydro-1H-chromeno[3,4-c]pyridin-10-ol GNF-PF-5188
TypeSmall organic molecule
Emp. Form.C21H31NO2
Mol. Mass.329.4763
SMILESCCCCCCc1cc(O)c2C3=C(CN(C)CC3)C(C)(C)Oc2c1