Reaction Details
TargetCannabinoid receptor 1
LigandBDBM50265686
Substrate/Competitorn/a
Meas. Tech.ChEMBL_560594 (CHEMBL1022319)
Ki>50±n/a nM
Citation Markt, PFeldmann, CRollinger, JMRaduner, SSchuster, DKirchmair, JDistinto, SSpitzer, GMWolber, GLaggner, CAltmann, KHLanger, TGertsch, J Discovery of novel CB2 receptor ligands by a pharmacophore-based virtual screening workflow. J Med Chem52:369-78 (2009) 
 
Cannabinoid receptor 1
Name:Cannabinoid receptor 1
Type:G Protein-Coupled Receptor (GPCR)
Mol. Mass.:52868.96
Organism:Homo sapiens (Human)
Description:P21554
Residue:472
BDBM50265686
NameBDBM50265686
Synonyms:(S)-2-(4-bromo-N-(4-ethoxyphenyl)phenylsulfonamido)-N-sec-butylacetamide | CHEMBL496578
TypeSmall organic molecule
Emp. Form.C20H25BrN2O4S
Mol. Mass.469.393
SMILESCCOc1ccc(cc1)N(CC(=O)N[C@@H](C)CC)S(=O)(=O)c1ccc(Br)cc1