Reaction Details
TargetCannabinoid receptor 1
LigandBDBM50240605
Substrate/Competitorn/a
Meas. Tech.ChEMBL_560594 (CHEMBL1022319)
Ki 3363±n/a nM
Citation Markt, PFeldmann, CRollinger, JMRaduner, SSchuster, DKirchmair, JDistinto, SSpitzer, GMWolber, GLaggner, CAltmann, KHLanger, TGertsch, J Discovery of novel CB2 receptor ligands by a pharmacophore-based virtual screening workflow. J Med Chem52:369-78 (2009) 
 
Cannabinoid receptor 1
Name:Cannabinoid receptor 1
Type:G Protein-Coupled Receptor (GPCR)
Mol. Mass.:52868.96
Organism:Homo sapiens (Human)
Description:P21554
Residue:472
BDBM50240605
NameBDBM50240605
Synonyms:(2,3-Dichloro-phenyl)-(5-methoxy-2-methyl-3-morpholin-4-ylmethyl-indol-1-yl)-methanone CHEMBL308777
TypeSmall organic molecule
Emp. Form.C22H22Cl2N2O3
Mol. Mass.433.328
SMILESCOc1ccc2n(C(=O)c3cccc(Cl)c3Cl)c(C)c(CN3CCOCC3)c2c1