Reaction Details
TargetCannabinoid receptor 1
LigandBDBM50222793
Substrate/Competitorn/a
Meas. Tech.ChEMBL_560594 (CHEMBL1022319)
Ki 604±n/a nM
Citation Markt, PFeldmann, CRollinger, JMRaduner, SSchuster, DKirchmair, JDistinto, SSpitzer, GMWolber, GLaggner, CAltmann, KHLanger, TGertsch, J Discovery of novel CB2 receptor ligands by a pharmacophore-based virtual screening workflow. J Med Chem52:369-78 (2009) 
 
Cannabinoid receptor 1
Name:Cannabinoid receptor 1
Type:G Protein-Coupled Receptor (GPCR)
Mol. Mass.:52868.96
Organism:Homo sapiens (Human)
Description:P21554
Residue:472
BDBM50222793
NameBDBM50222793
Synonyms:(4-(ethylsulfonyl)-2-propyl-1,2,3,4-tetrahydropyrrolo[3,4-b]indol-7-yl)(4-methylpiperidin-1-yl)methanone | CHEMBL400399
TypeSmall organic molecule
Emp. Form.C22H31N3O3S
Mol. Mass.417.565
SMILESCCCN1Cc2c(C1)c1cc(ccc1n2S(=O)(=O)CC)C(=O)N1CCC(C)CC1