Reaction Details
TargetCytochrome P450 26A1
LigandBDBM50253808
Substrate/Competitorn/a
Meas. Tech.ChEMBL_511280 (CHEMBL996935)
IC50 900±n/a nM
Citation Gomaa, MSArmstrong, JLBobillon, BVeal, GJBrancale, ARedfern, CPSimons, C Novel azolyl-(phenylmethyl)]aryl/heteroarylamines: potent CYP26 inhibitors and enhancers of all-trans retinoic acid activity in neuroblastoma cells. Bioorg Med Chem16:8301-13 (2008) 
 
Cytochrome P450 26A1
Name:Cytochrome P450 26A1
Type:Enzyme
Mol. Mass.:56216.16
Organism:Homo sapiens (Human)
Description:O43174
Residue:497
BDBM50253808
NameBDBM50253808
Synonyms:Benzooxazol-2-yl-{4-[(5H-imidazol-1-yl)-phenyl-methyl]-phenyl}-amine | CHEMBL518642
TypeSmall organic molecule
Emp. Form.C23H18N4O
Mol. Mass.366.4152
SMILESN(c1nc2ccccc2o1)c1ccc(cc1)C(c1ccccc1)n1ccnc1