Reaction Details
TargetCytochrome P450 26A1
LigandBDBM50253770
Substrate/Competitorn/a
Meas. Tech.ChEMBL_511280 (CHEMBL996935)
IC50 500±n/a nM
Citation Gomaa, MSArmstrong, JLBobillon, BVeal, GJBrancale, ARedfern, CPSimons, C Novel azolyl-(phenylmethyl)]aryl/heteroarylamines: potent CYP26 inhibitors and enhancers of all-trans retinoic acid activity in neuroblastoma cells. Bioorg Med Chem16:8301-13 (2008) 
 
Cytochrome P450 26A1
Name:Cytochrome P450 26A1
Type:Enzyme
Mol. Mass.:56216.16
Organism:Homo sapiens (Human)
Description:O43174
Residue:497
BDBM50253770
NameBDBM50253770
Synonyms:CHEMBL518482 | [4-(Imidazol-1-yl-phenyl-methyl)-phenyl]-naphthalen-2-yl-amine
TypeSmall organic molecule
Emp. Form.C26H21N3
Mol. Mass.375.465
SMILESN(c1ccc(cc1)C(c1ccccc1)n1ccnc1)c1ccc2ccccc2c1