Reaction Details
TargetCytochrome P450 26A1
LigandBDBM50253768
Substrate/Competitorn/a
Meas. Tech.ChEMBL_511280 (CHEMBL996935)
IC50 5000±n/a nM
Citation Gomaa, MSArmstrong, JLBobillon, BVeal, GJBrancale, ARedfern, CPSimons, C Novel azolyl-(phenylmethyl)]aryl/heteroarylamines: potent CYP26 inhibitors and enhancers of all-trans retinoic acid activity in neuroblastoma cells. Bioorg Med Chem16:8301-13 (2008) 
 
Cytochrome P450 26A1
Name:Cytochrome P450 26A1
Type:Enzyme
Mol. Mass.:56216.16
Organism:Homo sapiens (Human)
Description:O43174
Residue:497
BDBM50253768
NameBDBM50253768
Synonyms:CHEMBL459925 | Phenyl-[4-(phenyl-imidazol-1-yl-methyl)-phenyl]-amine
TypeSmall organic molecule
Emp. Form.C22H19N3
Mol. Mass.325.4064
SMILESN(c1ccccc1)c1ccc(cc1)C(c1ccccc1)n1ccnc1