Reaction Details
TargetCytochrome P450 26A1
LigandBDBM50377963
Substrate/Competitorn/a
Meas. Tech.ChEMBL_511280 (CHEMBL996935)
IC50 5±n/a nM
Citation Gomaa, MSArmstrong, JLBobillon, BVeal, GJBrancale, ARedfern, CPSimons, C Novel azolyl-(phenylmethyl)]aryl/heteroarylamines: potent CYP26 inhibitors and enhancers of all-trans retinoic acid activity in neuroblastoma cells. Bioorg Med Chem16:8301-13 (2008) 
 
Cytochrome P450 26A1
Name:Cytochrome P450 26A1
Type:Enzyme
Mol. Mass.:56216.16
Organism:Homo sapiens (Human)
Description:O43174
Residue:497
BDBM50377963
NameBDBM50377963
Synonyms:CHEMBL224305 | R-115866
TypeSmall organic molecule
Emp. Form.C21H23N5S
Mol. Mass.377.506
SMILESCCC(CC)[C@H](c1ccc(Nc2nc3ccccc3s2)cc1)n1cncn1