Reaction Details
TargetDelta-type opioid receptor
LigandBDBM50252830
Substrate/Competitorn/a
Meas. Tech.ChEMBL_534603 (CHEMBL989028)
EC50 380±n/a nM
Citation Le Bourdonnec, BWindh, RTAjello, CWLeister, LKGu, MChu, GHTuthill, PABarker, WMKoblish, MWiant, DDGraczyk, TMBelanger, SCassel, JAFeschenko, MSBrogdon, BLSmith, SAChrist, DDDerelanko, MJKutz, SLittle, PJDeHaven, RNDeHaven-Hudkins, DLDolle, RE Potent, orally bioavailable delta opioid receptor agonists for the treatment of pain: discovery of N,N-diethyl-4-(5-hydroxyspiro[chromene-2,4'-piperidine]-4-yl)benzamide (ADL5859). J Med Chem51:5893-6 (2008) 
 
Delta-type opioid receptor
Name:Delta-type opioid receptor
Type:G Protein-Coupled Receptor (GPCR)
Mol. Mass.:40382.98
Organism:Homo sapiens (Human)
Description:Competition binding assays were carried out using membrane preparations from transfected HN9.10 cells that constitutively expressed the delta opioid receptor.
Residue:372
BDBM50252830
NameBDBM50252830
Synonyms:4-Phenylspiro[chromene-2,4'-piperidine] | CHEMBL492447
TypeSmall organic molecule
Emp. Form.C19H19NO
Mol. Mass.277.3603
SMILESC1CC2(CCN1)Oc1ccccc1C(=C2)c1ccccc1