Reaction Details
TargetPotassium voltage-gated channel subfamily H member 2
LigandBDBM50252924
Substrate/Competitorn/a
Meas. Tech.ChEMBL_534605 (CHEMBL989030)
IC50 47440±n/a nM
Citation Le Bourdonnec, BWindh, RTAjello, CWLeister, LKGu, MChu, GHTuthill, PABarker, WMKoblish, MWiant, DDGraczyk, TMBelanger, SCassel, JAFeschenko, MSBrogdon, BLSmith, SAChrist, DDDerelanko, MJKutz, SLittle, PJDeHaven, RNDeHaven-Hudkins, DLDolle, RE Potent, orally bioavailable delta opioid receptor agonists for the treatment of pain: discovery of N,N-diethyl-4-(5-hydroxyspiro[chromene-2,4'-piperidine]-4-yl)benzamide (ADL5859). J Med Chem51:5893-6 (2008) 
 
Potassium voltage-gated channel subfamily H member 2
Name:Potassium voltage-gated channel subfamily H member 2
Type:Multi-pass membrane protein
Mol. Mass.:126672.65
Organism:Homo sapiens (Human)
Description:Q12809
Residue:1159
BDBM50252924
NameBDBM50252924
Synonyms:4-(1'-Acetylspiro[chromene-2,4'-piperidine]-4-yl)-N,Ndiethylbenzamide | CHEMBL494274
TypeSmall organic molecule
Emp. Form.C26H30N2O3
Mol. Mass.418.528
SMILESCCN(CC)C(=O)c1ccc(cc1)C1=CC2(CCN(CC2)C(C)=O)Oc2ccccc12